BDBM50483155 CHEMBL1630076
SMILES CC(OC(=O)Nc1ccccc1)c1sc2nccn2c1C
InChI Key InChIKey=DOEHRRKVBJGRIT-UHFFFAOYSA-N
Data  1 IC50
  Tab Delimited (TSV)   2D SDfile   Computed 3D by Vconf -m prep SDfile
Find this compound or compounds like it in BindingDB:
Activity Spreadsheet -- Enzyme Inhibition Constant Data from BindingDB
Found 1 hit for monomerid = 50483155
TargetMetabotropic glutamate receptor 5(Homo sapiens (Human))
Medicines Research Centre
Curated by ChEMBL
LigandPNGBDBM50483155(CHEMBL1630076)
Affinity DataIC50:  13nM. Assay description: Antagonist activity at human mGluR5 expressed in CHO cells assessed as doxycycline induced calcium mobilization
Ligand InfoPC cidPC sid
In DepthDetails ArticlePubMed