BDBM50483633 CHEMBL1761162
SMILES [Cl-].COc1ccc2cc[n+](CCc3ccccc3C)cc2c1OC
InChI Key InChIKey=APTBCUAVRRKNQU-UHFFFAOYSA-N
Data  1 IC50
  Tab Delimited (TSV)   2D SDfile   Computed 3D by Vconf -m prep SDfile
Find this compound or compounds like it in BindingDB:
Activity Spreadsheet -- Enzyme Inhibition Constant Data from BindingDB
Found 1 hit for monomerid = 50483633
TargetPlatelet glycoprotein 4(Homo sapiens)
Chinese Academy Of Medical Sciences And Peking Union Medical College
Curated by ChEMBL
LigandPNGBDBM50483633(CHEMBL1761162)
Affinity DataIC50:  4.36E+3nM. Assay description: Antagonist activity at human CD36-oxLDL binding after 2 hrs by ELISA
Ligand InfoPC cidPC sid
In DepthDetails ArticlePubMed