BDBM50485077 CHEMBL2023517
SMILES C[C@@](CCn1ccc(cc1=O)-c1ccc(Cl)c(F)c1F)(C(=O)NO)S(C)(=O)=O
InChI Key InChIKey=JDALVRLKLJTOMR-QGZVFWFLSA-N
Data  1 IC50
  Tab Delimited (TSV)   2D SDfile   Computed 3D by Vconf -m prep SDfile
Find this compound or compounds like it in BindingDB:
Activity Spreadsheet -- Enzyme Inhibition Constant Data from BindingDB
Found 1 hit for monomerid = 50485077
TargetUDP-3-O-acyl-N-acetylglucosamine deacetylase(Pseudomonas aeruginosa)
Pfizer
Curated by ChEMBL
LigandPNGBDBM50485077(CHEMBL2023517)
Affinity DataIC50:  0.520nM. Assay description: Inhibition of Pseudomonas aeruginosa LpxC expressed in Escherichia coli using UDP-3-O-N-acetylglucosamine substrate measured after 30 mins by mass sp...
Ligand InfoPC cidPC sid
In DepthDetails ArticlePubMed