BDBM50485312 CHEMBL2048319
SMILES [H][C@@]1(CC[C@@]2([H])[C@]3([H])CC=C4C[C@@H](O)CC[C@]4(C)[C@@]3([H])CC[C@]12C)[C@H](C)CCCC(C)=CC
InChI Key InChIKey=UEIPNWLVPIGVLH-PXBBAZSNSA-N
Data  1 Kd
  Tab Delimited (TSV)   2D SDfile   Computed 3D by Vconf -m prep SDfile
Find this compound or compounds like it in BindingDB:
Activity Spreadsheet -- Enzyme Inhibition Constant Data from BindingDB
Found 1 hit for monomerid = 50485312
TargetSteroid C26-monooxygenase(Mycobacterium tuberculosis)
University Of California San Francisco
Curated by ChEMBL
LigandPNGBDBM50485312(CHEMBL2048319)
Affinity DataKd:  450nM. Assay description: Binding affinity to Mycobacterium tuberculosis CYP125A1 by UV-visible spectrophotometry
Ligand InfoPC cidPC sid
In DepthDetails ArticlePubMed