BDBM50488843 3-PROPYLADENINE
SMILES CCCn1cnc(N)c2ncnc12
InChI Key InChIKey=JLXQFMRFJJEIIQ-UHFFFAOYSA-N
Data  1 IC50
  Tab Delimited (TSV)   2D SDfile   Computed 3D by Vconf -m prep SDfile
Find this compound or compounds like it in BindingDB:
Activity Spreadsheet -- Enzyme Inhibition Constant Data from BindingDB
Found 1 hit for monomerid = 50488843
TargetDNA-3-methyladenine glycosylase 1(Escherichia coli (strain K12))TBA
LigandPNGBDBM50488843(3-PROPYLADENINE)
Affinity DataIC50:  5.00E+3nM. Assay description: Inhibition of Escherichia coli DNA-3-methyladenine glycosylase 1
Ligand InfoPC cidPC sid
In DepthDetails Article