BDBM50488845 3-ETHYLADENINE
SMILES CCn1cnc(N)c2ncnc12
InChI Key InChIKey=SDAWCCIAGJBZBM-UHFFFAOYSA-N
Data  1 IC50
  Tab Delimited (TSV)   2D SDfile   Computed 3D by Vconf -m prep SDfile
Find this compound or compounds like it in BindingDB:
Activity Spreadsheet -- Enzyme Inhibition Constant Data from BindingDB
Found 1 hit for monomerid = 50488845
TargetDNA-3-methyladenine glycosylase 1(Escherichia coli (strain K12))TBA
LigandPNGBDBM50488845(3-ETHYLADENINE)
Affinity DataIC50:  5.00E+4nM. Assay description: Inhibition of Escherichia coli DNA-3-methyladenine glycosylase 1
In DepthDetails Article