BDBM50490452 CHEMBL2321917
SMILES CCCN(c1ccc(cc1)C(O)=O)c1cc2c(cc1C)C(C)(C)CCC2(C)C
InChI Key InChIKey=UTMNEIYECBFYIE-UHFFFAOYSA-N
Data  1 EC50
  Tab Delimited (TSV)   2D SDfile   Computed 3D by Vconf -m prep SDfile
Find this compound or compounds like it in BindingDB:
Activity Spreadsheet -- Enzyme Inhibition Constant Data from BindingDB
Found 1 hit for monomerid = 50490452
TargetRetinoic acid receptor RXR-alpha/RXR-beta/RXR-gamma(Homo sapiens (Human))
Tohoku Pharmaceutical University
Curated by ChEMBL
LigandPNGBDBM50490452(CHEMBL2321917)
Affinity DataEC50:  0.140nM. Assay description: Agonist activity at RXR (unknown origin) in presence of RAR agonist Am80
Ligand InfoPC cidPC sid
In DepthDetails ArticlePubMed