BDBM50490524 CHEMBL2326630
SMILES COc1c(F)ccc2n(Cc3cccc(CNC(C)=O)c3)nc(NS(=O)(=O)c3ccc(Cl)s3)c12
InChI Key InChIKey=TVVJOUFRFOLJOS-UHFFFAOYSA-N
Data  1 IC50
  Tab Delimited (TSV)   2D SDfile   Computed 3D by Vconf -m prep SDfile
Find this compound or compounds like it in BindingDB:
Activity Spreadsheet -- Enzyme Inhibition Constant Data from BindingDB
Found 1 hit for monomerid = 50490524
TargetC-C chemokine receptor type 4(Homo sapiens (Human))
Glaxosmithkline
Curated by ChEMBL
LigandPNGBDBM50490524(CHEMBL2326630)
Affinity DataIC50:  13nM. Assay description: Antagonist activity at human recombinant CCR4 receptor expressed in CHO cell membranes by [35S]GTPgammaS binding assay
Ligand InfoPC cidPC sid
In DepthDetails ArticlePubMed