BDBM50495234 CHEMBL3104106
SMILES Cc1cc(O)cc(C)c1C[C@H](N)C(=O)N1CCC(Cc2ccccc2)CC1
InChI Key InChIKey=CTWBAHNLIQXLPU-QFIPXVFZSA-N
Data  3 KI
  Tab Delimited (TSV)   2D SDfile   Computed 3D by Vconf -m prep SDfile
Find this compound or compounds like it in BindingDB:
Activity Spreadsheet -- Enzyme Inhibition Constant Data from BindingDB
Found 3 hits for monomerid = 50495234
TargetMu-type opioid receptor(Rattus norvegicus (rat))
University Of Michigan
Curated by ChEMBL
LigandPNGBDBM50495234(CHEMBL3104106)
Affinity DataKi:  1.40nM. Assay description: Displacement of [3H]diprenorphine from rat mu opioid receptor expressed in rat C6 cell membranes after 1 hr by liquid scintillation counting analysis
Ligand InfoPC cidPC sid
In DepthDetails ArticlePubMed
TargetDelta-type opioid receptor(Rattus norvegicus (rat))
University Of Michigan
Curated by ChEMBL
LigandPNGBDBM50495234(CHEMBL3104106)
Affinity DataKi:  7.80nM. Assay description: Displacement of [3H]diprenorphine from rat delta opioid receptor expressed in rat C6 cell membranes after 1 hr by liquid scintillation counting analy...
Ligand InfoPC cidPC sid
In DepthDetails ArticlePubMed
TargetKappa-type opioid receptor(Homo sapiens (Human))
University Of Michigan
Curated by ChEMBL
LigandPNGBDBM50495234(CHEMBL3104106)
Affinity DataKi:  140nM. Assay description: Displacement of [3H]diprenorphine from human kappa opioid receptor expressed in CHO cell membranes after 1 hr by liquid scintillation counting analys...
Ligand InfoPC cidPC sid
In DepthDetails ArticlePubMed