BDBM50495254 CHEMBL3104273
SMILES CS(=O)(=O)NCCSc1nc(N)nc(n1)-c1c(Cl)cc2COCc3cccc1c23
InChI Key InChIKey=VHXXRRBKPQYFCA-UHFFFAOYSA-N
Data  1 Kd
  Tab Delimited (TSV)   2D SDfile   Computed 3D by Vconf -m prep SDfile
Find this compound or compounds like it in BindingDB:
Activity Spreadsheet -- Enzyme Inhibition Constant Data from BindingDB
Found 1 hit for monomerid = 50495254
TargetHeat shock protein HSP 90-alpha(Homo sapiens (Human))
Chugai Pharmaceutical
Curated by ChEMBL
LigandPNGBDBM50495254(CHEMBL3104273)
Affinity DataKd:  0.430nM. Assay description: Binding affinity to human biotinylated N-terminal Hsp90alpha (9 to 236) by surface plasmon resonance assay
Ligand InfoPC cidPC sid
In DepthDetails ArticlePubMed