BDBM50497039 CHEMBL3248383
SMILES CCN(CC)C[C@H]1COc2ccccc2O1
InChI Key InChIKey=BGWGNDUTMDMIKZ-NSHDSACASA-N
Data  1 Kd
  Tab Delimited (TSV)   2D SDfile   Computed 3D by Vconf -m prep SDfile
Find this compound or compounds like it in BindingDB:
Activity Spreadsheet -- Enzyme Inhibition Constant Data from BindingDB
Found 1 hit for monomerid = 50497039
LigandPNGBDBM50497039(CHEMBL3248383)
Affinity DataKd:  617nM. Assay description: Displacement of [3H]dihydroazapetine from alpha-adrenoreceptor in rat vas deferens
In DepthDetails ArticlePubMed