BDBM50498026 CHEMBL3326319
SMILES CCOc1cccc(c1N)-c1cc(=O)c2ccccc2o1
InChI Key InChIKey=RPRXTMMATKGDLA-UHFFFAOYSA-N
Data  1 IC50
  Tab Delimited (TSV)   2D SDfile   Computed 3D by Vconf -m prep SDfile
Find this compound or compounds like it in BindingDB:
Activity Spreadsheet -- Enzyme Inhibition Constant Data from BindingDB
Found 1 hit for monomerid = 50498026
TargetDual specificity mitogen-activated protein kinase kinase 2(Rattus norvegicus)
University Of Gothenburg
Curated by ChEMBL
LigandPNGBDBM50498026(CHEMBL3326319)
Affinity DataIC50:  1.00E+3nM. Assay description: Inhibition of MEK1/2 in rat IEC6 cells assessed as reduction in ERK1/2 loop phosphorylation dosed 30 mins before to stimulation with 10% serum for 5 ...
Ligand InfoPC cidPC sid
In DepthDetails ArticlePubMed