BDBM50498950 CHEMBL3736230
SMILES CC[C@H](C)[C@H](NC(=O)CNC(=O)[C@H](CC(O)=O)NC(=O)[C@H](CO)NC(=O)[C@@H](N)Cc1cnc[nH]1)C(=O)N[C@@H](Cc1ccc(cc1)C#Cc1ccccc1)C(=O)N[C@@H]([C@@H](C)O)C(=O)N[C@@H](CC(O)=O)C(=O)N[C@@H](CO)C(=O)N[C@@H](Cc1ccc(O)cc1)C(=O)N[C@@H](CO)C(=O)N[C@@H](CCCNC(N)=N)C(=O)N[C@@H](Cc1ccc(O)cc1)C(=O)N[C@@H](CCCNC(N)=N)C(=O)N[C@@H](CCCCN)C(=O)N[C@@H](CCC(N)=O)C(=O)N[C@@H](CCSC)C(=O)N[C@@H](C)C(=O)N[C@@H](C(C)C)C(=O)N[C@@H](CCCCN)C(=O)N[C@@H](CCCCN)C(=O)N[C@@H](Cc1ccc(O)cc1)C(=O)N[C@@H](CC(C)C)C(=O)N[C@@H](C)C(=O)N[C@@H](C)C(=O)N[C@@H](C(C)C)C(=O)N[C@@H](CC(C)C)C(N)=O
InChI Key InChIKey=UFKWYYSODZYURD-BXXOXGIYSA-N
Data  6 IC50
  Tab Delimited (TSV)   2D SDfile   Computed 3D by Vconf -m prep SDfile
Find this compound or compounds like it in BindingDB:
Activity Spreadsheet -- Enzyme Inhibition Constant Data from BindingDB
Found 6 hits for monomerid = 50498950
TargetPituitary adenylate cyclase-activating polypeptide type I receptor(Homo sapiens (Human))
Universit£
Curated by ChEMBL
LigandPNGBDBM50498950(CHEMBL3736230)
Affinity DataIC50:  45nM. Assay description: Displacement of Ac-[125I]-PACAP27 from recombinant human PAC1 expressed in CHO cells after 90 mins by gamma counting analysis
Ligand InfoPC cidPC sid
In DepthDetails ArticlePubMed
TargetVasoactive intestinal polypeptide receptor 1(Homo sapiens (Human))
Universit£
Curated by ChEMBL
LigandPNGBDBM50498950(CHEMBL3736230)
Affinity DataIC50:  12nM. Assay description: Displacement of Ac-[125I]-PACAP27 from recombinant human VPAC1 expressed in CHO cells after 90 mins by gamma counting analysis
Ligand InfoPC cidPC sid
In DepthDetails ArticlePubMed
TargetPituitary adenylate cyclase-activating polypeptide type I receptor(Homo sapiens (Human))
Universit£
Curated by ChEMBL
LigandPNGBDBM50498950(CHEMBL3736230)
Affinity DataIC50:  44.7nM. Assay description: Displacement of Ac-[125I]-PACAP27 from recombinant human PAC1 expressed in CHO cells after 90 mins by gamma counting analysis
Ligand InfoPC cidPC sid
In DepthDetails ArticlePubMed
TargetVasoactive intestinal polypeptide receptor 2(Homo sapiens (Human))
Universit£
Curated by ChEMBL
LigandPNGBDBM50498950(CHEMBL3736230)
Affinity DataIC50:  53nM. Assay description: Displacement of Ac-[125I]-PACAP27 from recombinant human VPAC2 expressed in CHO cells after 90 mins by gamma counting analysis
Ligand InfoPC cidPC sid
In DepthDetails ArticlePubMed
TargetVasoactive intestinal polypeptide receptor 1(Homo sapiens (Human))
Universit£
Curated by ChEMBL
LigandPNGBDBM50498950(CHEMBL3736230)
Affinity DataIC50:  11nM. Assay description: Displacement of Ac-[125I]-PACAP27 from recombinant human VPAC1 expressed in CHO cells after 90 mins by gamma counting analysis
Ligand InfoPC cidPC sid
In DepthDetails ArticlePubMed
TargetVasoactive intestinal polypeptide receptor 2(Homo sapiens (Human))
Universit£
Curated by ChEMBL
LigandPNGBDBM50498950(CHEMBL3736230)
Affinity DataIC50:  54nM. Assay description: Displacement of Ac-[125I]-PACAP27 from recombinant human VPAC2 expressed in CHO cells after 90 mins by gamma counting analysis
Ligand InfoPC cidPC sid
In DepthDetails ArticlePubMed