BDBM50499643 CHEMBL3742384
SMILES Cc1ccc(cc1)-c1ccc(CN2CC(C2)C(O)=O)cc1
InChI Key InChIKey=FVHPVOYRHVTLRW-UHFFFAOYSA-N
Data  3 IC50
  Tab Delimited (TSV)   2D SDfile   Computed 3D by Vconf -m prep SDfile
Find this compound or compounds like it in BindingDB:
Activity Spreadsheet -- Enzyme Inhibition Constant Data from BindingDB
Found 3 hits for monomerid = 50499643
TargetSphingosine 1-phosphate receptor 3(Homo sapiens (Human))
Abbvie Bioresearch Center
Curated by ChEMBL
LigandPNGBDBM50499643(CHEMBL3742384)
Affinity DataIC50: >1.00E+4nM. Assay description: Displacement of [33P]S1P from S1P3 receptor (unknown origin) expressed in HEK cell membranes after 45 to 60 mins by scintillation counting based RLB ...
Ligand InfoPC cidPC sid
In DepthDetails ArticlePubMed
TargetSphingosine 1-phosphate receptor 5(Homo sapiens (Human))
Abbvie Bioresearch Center
Curated by ChEMBL
LigandPNGBDBM50499643(CHEMBL3742384)
Affinity DataIC50:  7nM. Assay description: Displacement of [33P]S1P from S1P5 receptor (unknown origin) expressed in HEK cell membranes after 45 to 60 mins by scintillation counting based RLB ...
Ligand InfoPC cidPC sid
In DepthDetails ArticlePubMed
TargetSphingosine 1-phosphate receptor 1(Homo sapiens (Human))
Abbvie Bioresearch Center
Curated by ChEMBL
LigandPNGBDBM50499643(CHEMBL3742384)
Affinity DataIC50:  7.21E+3nM. Assay description: Displacement of [33P]S1P from S1P1 receptor (unknown origin) expressed in HEK cell membranes after 45 to 60 mins by scintillation counting based RLB ...
Ligand InfoPC cidPC sid
In DepthDetails ArticlePubMed