BDBM50499655 CHEMBL3742345
SMILES OC(=O)C1CN(Cc2ccc(cc2)-c2ccc(Cl)c(Cl)c2)C1
InChI Key InChIKey=BGZCTGTUNZJPEX-UHFFFAOYSA-N
Data  2 IC50
  Tab Delimited (TSV)   2D SDfile   Computed 3D by Vconf -m prep SDfile
Find this compound or compounds like it in BindingDB:
Activity Spreadsheet -- Enzyme Inhibition Constant Data from BindingDB
Found 2 hits for monomerid = 50499655
TargetSphingosine 1-phosphate receptor 5(Homo sapiens (Human))
Abbvie Bioresearch Center
Curated by ChEMBL
LigandPNGBDBM50499655(CHEMBL3742345)
Affinity DataIC50:  23nM. Assay description: Displacement of [33P]S1P from S1P5 receptor (unknown origin) expressed in HEK cell membranes after 45 to 60 mins by scintillation counting based RLB ...
Ligand InfoPC cidPC sid
In DepthDetails ArticlePubMed
TargetSphingosine 1-phosphate receptor 1(Homo sapiens (Human))
Abbvie Bioresearch Center
Curated by ChEMBL
LigandPNGBDBM50499655(CHEMBL3742345)
Affinity DataIC50:  4.41E+3nM. Assay description: Displacement of [33P]S1P from S1P1 receptor (unknown origin) expressed in HEK cell membranes after 45 to 60 mins by scintillation counting based RLB ...
Ligand InfoPC cidPC sid
In DepthDetails ArticlePubMed