BDBM50501197 CHEMBL3940618
SMILES Oc1ccc(CNNC(=O)CCCCc2ccccc2)c(O)c1O
InChI Key InChIKey=CQOBRJZTCBMPTI-UHFFFAOYSA-N
Data  1 IC50
  Tab Delimited (TSV)   2D SDfile   Computed 3D by Vconf -m prep SDfile
Find this compound or compounds like it in BindingDB:
Activity Spreadsheet -- Enzyme Inhibition Constant Data from BindingDB
Found 1 hit for monomerid = 50501197
TargetGenome polyprotein(Coxsackievirus B3 (strain Nancy))
Gwangju Institute Of Science And Technology (Gist)
Curated by ChEMBL
LigandPNGBDBM50501197(CHEMBL3940618)
Affinity DataIC50:  190nM. Assay description: Inhibition of recombinant Coxsackievirus B3 3C protease expressed in Escherichia coli BL21 (DE3) preincubated for 5 mins followed by addition of NMA-...
Ligand InfoPC cidPC sid
In DepthDetails ArticlePubMed