BDBM50501337 CHEMBL3941415
SMILES Nc1nc2n(cnc2c(=O)[nH]1)[C@@H]1O[C@H](COP(O)(=O)C(F)P(O)(=O)OCCNC(=O)CCl)[C@@H](O)[C@H]1O
InChI Key InChIKey=GLBJMYLSMRVUEQ-BBWYTPCNSA-N
Data  1 KI
  Tab Delimited (TSV)   2D SDfile   Computed 3D by Vconf -m prep SDfile
Find this compound or compounds like it in BindingDB:
Activity Spreadsheet -- Enzyme Inhibition Constant Data from BindingDB
Found 1 hit for monomerid = 50501337
TargetGTPase KRas(Homo sapiens (Human))
Dana Farber Cancer Institute
Curated by ChEMBL
LigandPNGBDBM50501337(CHEMBL3941415)
Affinity DataKi:  8.00E+3nM. Assay description: Binding affinity to GMP-stabilized FLAG-tagged KRAS G12C mutant (unknown origin) using desthiobiotin-GTP probe by alphascreen assay
Ligand InfoPC cidPC sid
In DepthDetails ArticlePubMed