BDBM50501341 CHEMBL3897666
SMILES Nc1nc2n(cnc2c(=O)[nH]1)[C@@H]1O[C@H](COP(O)(=O)CP(O)(=O)OC2CCN(C2)C(=O)CCl)[C@@H](O)[C@H]1O
InChI Key InChIKey=LJTMPXPZQSNWRF-WTBWQYLWSA-N
Data  1 KI
  Tab Delimited (TSV)   2D SDfile   Computed 3D by Vconf -m prep SDfile
Find this compound or compounds like it in BindingDB:
Activity Spreadsheet -- Enzyme Inhibition Constant Data from BindingDB
Found 1 hit for monomerid = 50501341
TargetGTPase KRas(Homo sapiens (Human))
Dana Farber Cancer Institute
Curated by ChEMBL
LigandPNGBDBM50501341(CHEMBL3897666)
Affinity DataKi:  920nM. Assay description: Binding affinity to GMP-stabilized FLAG-tagged KRAS G12C mutant (unknown origin) using desthiobiotin-GTP probe by alphascreen assay
Ligand InfoPC cidPC sid
In DepthDetails ArticlePubMed