BDBM50501706 CHEMBL4069040
SMILES COc1ccc(cc1OC)-c1cc(nc(=S)[nH]1)-c1c(C)oc2c(OC)c3occc3c(OC)c2c1=O
InChI Key InChIKey=MZGGHHGJRULCHN-UHFFFAOYSA-N
Data  1 IC50
  Tab Delimited (TSV)   2D SDfile   Computed 3D by Vconf -m prep SDfile
Find this compound or compounds like it in BindingDB:
Activity Spreadsheet -- Enzyme Inhibition Constant Data from BindingDB
Found 1 hit for monomerid = 50501706
TargetMitogen-activated protein kinase 11/12/13/14(Homo sapiens (Human))
Cairo University
Curated by ChEMBL
LigandPNGBDBM50501706(CHEMBL4069040)
Affinity DataIC50:  1.39E+3nM. Assay description: Inhibition of p38 MAPK (unknown origin) using ATF2 as substrate measured after 15 by ELISA
Ligand InfoPC cidPC sid
In DepthDetails ArticlePubMed