BDBM50505564 CHEMBL4527867
SMILES CC[C@H](C)[C@H](N(C)C)C(=O)O[C@@H](CC(C)C)C(=O)N[C@@H](CC(C)C)C(=O)N[C@@H](Cc1ccccc1)\C=C\C(=O)N1[C@@H](Cc2ccccc2)C(OC)=CC1=O
InChI Key InChIKey=YUJAVMJKRUKNMF-KDEMWJIUSA-N
Data  2 IC50
  Tab Delimited (TSV)   2D SDfile   Computed 3D by Vconf -m prep SDfile
Find this compound or compounds like it in BindingDB:
Activity Spreadsheet -- Enzyme Inhibition Constant Data from BindingDB
Found 2 hits for monomerid = 50505564
TargetProcathepsin L(Homo sapiens (Human))
The University Of Jordan
Curated by ChEMBL
LigandPNGBDBM50505564(CHEMBL4527867)
Affinity DataIC50:  3.10nM. Assay description: Inhibition of human cathepsin L using fluorogenic substrate cbz-FR-AMC monitored for 90 to 120 mins by spectrophotometry
Ligand InfoPC cidPC sid
In DepthDetails ArticlePubMed
TargetCruzipain(Trypanosoma cruzi)
The University Of Jordan
Curated by ChEMBL
LigandPNGBDBM50505564(CHEMBL4527867)
Affinity DataIC50:  1.20nM. Assay description: Inhibition of recombinant Trypanosoma cruzi Cruzain expressed in Pichia pastoris using Z-Phe-Arg-AMC substrate incubated for 30 mins by fluorescence ...
Ligand InfoPC cidPC sid
In DepthDetails ArticlePubMed