BDBM50505568 CHEMBL4482954
SMILES CC[C@H](C)[C@H](N(C)C)C(=O)O[C@@H](CC(C)C)C(=O)N[C@@H](CC(C)C)C(=O)N[C@@H](C)\C=C\C(=O)N1[C@@H](CC(C)C)C(OC)=CC1=O
InChI Key InChIKey=BFANIUCLYPUKCM-NYMMDBBYSA-N
Data  2 IC50
  Tab Delimited (TSV)   2D SDfile   Computed 3D by Vconf -m prep SDfile
Find this compound or compounds like it in BindingDB:
Activity Spreadsheet -- Enzyme Inhibition Constant Data from BindingDB
Found 2 hits for monomerid = 50505568
TargetProcathepsin L(Homo sapiens (Human))
The University Of Jordan
Curated by ChEMBL
LigandPNGBDBM50505568(CHEMBL4482954)
Affinity DataIC50:  1.70nM. Assay description: Inhibition of human cathepsin L using fluorogenic substrate cbz-FR-AMC monitored for 90 to 120 mins by spectrophotometry
Ligand InfoPC cidPC sid
In DepthDetails ArticlePubMed
TargetCruzipain(Trypanosoma cruzi)
The University Of Jordan
Curated by ChEMBL
LigandPNGBDBM50505568(CHEMBL4482954)
Affinity DataIC50:  0.490nM. Assay description: Inhibition of recombinant Trypanosoma cruzi Cruzain expressed in Pichia pastoris using Z-Phe-Arg-AMC substrate incubated for 30 mins by fluorescence ...
Ligand InfoPC cidPC sid
In DepthDetails ArticlePubMed