BDBM50507054 CHEMBL4454382
SMILES CC(C)(C)OC(=O)N1CCC(Cn2ccc3ccc(cc23)-c2ccc3ccn(Cc4cccc(c4)C(O)=O)c3c2)CC1
InChI Key InChIKey=XBVDPJBREJZMOQ-UHFFFAOYSA-N
Data  1 KI  1 IC50
  Tab Delimited (TSV)   2D SDfile   Computed 3D by Vconf -m prep SDfile
Find this compound or compounds like it in BindingDB:
Activity Spreadsheet -- Enzyme Inhibition Constant Data from BindingDB
Found 2 hits for monomerid = 50507054
TargetEnvelope glycoprotein gp160(Human immunodeficiency virus 1)
Touro University-California
Curated by ChEMBL
LigandPNGBDBM50507054(CHEMBL4454382)
Affinity DataKi:  1.20E+3nM. Assay description: Binding affinity to HIV1 N-terminal 2,2-bipyridine-5-carboxylate-capped Envelope glycoprotein gp41 Fe2(env2.0)3 by C18FL probe based fluorescence que...
Ligand InfoPC cidPC sid
In DepthDetails ArticlePubMed
TargetEnvelope glycoprotein gp160(Human immunodeficiency virus 1)
Touro University-California
Curated by ChEMBL
LigandPNGBDBM50507054(CHEMBL4454382)
Affinity DataIC50:  1.20E+3nM. Assay description: Inhibition of HIV1 gp41-induced cell-cell fusion between viral protein expressing human HL2/3 cells and TZM-bl target cells preincubated overnight wi...
Ligand InfoPC cidPC sid
In DepthDetails ArticlePubMed