BDBM50507070 CHEMBL4458236
SMILES CN(C(=O)OC(C)(C)C)c1cccc(c1)-c1ccc2ccn(Cc3cccc(c3)C(O)=O)c2c1
InChI Key InChIKey=CFKHQICAFSBJKG-UHFFFAOYSA-N
Data  1 KI  1 IC50
  Tab Delimited (TSV)   2D SDfile   Computed 3D by Vconf -m prep SDfile
Find this compound or compounds like it in BindingDB:
Activity Spreadsheet -- Enzyme Inhibition Constant Data from BindingDB
Found 2 hits for monomerid = 50507070
TargetEnvelope glycoprotein gp160(Human immunodeficiency virus 1)
Touro University-California
Curated by ChEMBL
LigandPNGBDBM50507070(CHEMBL4458236)
Affinity DataKi:  1.60E+3nM. Assay description: Binding affinity to HIV1 N-terminal 2,2-bipyridine-5-carboxylate-capped Envelope glycoprotein gp41 Fe2(env2.0)3 by C18FL probe based fluorescence que...
Ligand InfoPC cidPC sid
In DepthDetails ArticlePubMed
TargetEnvelope glycoprotein gp160(Human immunodeficiency virus 1)
Touro University-California
Curated by ChEMBL
LigandPNGBDBM50507070(CHEMBL4458236)
Affinity DataIC50:  5.90E+3nM. Assay description: Inhibition of HIV1 gp41-induced cell-cell fusion between viral protein expressing human HL2/3 cells and TZM-bl target cells preincubated overnight wi...
Ligand InfoPC cidPC sid
In DepthDetails ArticlePubMed