BDBM50507472 CHEMBL4548064
SMILES CC(=O)N[C@@H]1[C@@H](O)[C@H](O)[C@@H](CO)O[C@H]1SCCNCCCN1C(=O)c2cccc3c(Br)ccc(C1=O)c23
InChI Key InChIKey=VLYRSEFFGMYMKI-QRBWNZBVSA-N
Data  2 KI
  Tab Delimited (TSV)   2D SDfile   Computed 3D by Vconf -m prep SDfile
Find this compound or compounds like it in BindingDB:
Activity Spreadsheet -- Enzyme Inhibition Constant Data from BindingDB
Found 2 hits for monomerid = 50507472
TargetProtein O-GlcNAcase(Homo sapiens (Human))
China Agricultural University
Curated by ChEMBL
LigandPNGBDBM50507472(CHEMBL4548064)
Affinity DataKi:  900nM. Assay description: Inhibition of recombinant human OGA expressed in Escherichia coli BL21 (DE3) using varying levels of 4-Mu-GlcNAc as substrate preincubated for 10 min...
Ligand InfoPC cidPC sid
In DepthDetails ArticlePubMed
TargetBeta-hexosaminidase subunit beta(Homo sapiens (Human))
China Agricultural University
Curated by ChEMBL
LigandPNGBDBM50507472(CHEMBL4548064)
Affinity DataKi:  1.80E+3nM. Assay description: Inhibition of recombinant human His6-tagged HexB expressed in Pichia pastoris using varying levels of 4-Mu-GlcNAc as substrate preincubated for 10 mi...
Ligand InfoPC cidPC sid
In DepthDetails ArticlePubMed