BDBM50509538 CHEMBL4513295
SMILES CO[C@@H]1O[C@H](CO)[C@H](O)[C@H](Nc2cccc(C)c2)[C@H]1O
InChI Key InChIKey=UDBXDZFZJLLAHW-MBJXGIAVSA-N
Data  5 Kd
  Tab Delimited (TSV)   2D SDfile   Computed 3D by Vconf -m prep SDfile
Find this compound or compounds like it in BindingDB:
Activity Spreadsheet -- Enzyme Inhibition Constant Data from BindingDB
Found 5 hits for monomerid = 50509538
TargetGalectin-9(Homo sapiens (Human))
Lund University
Curated by ChEMBL
LigandPNGBDBM50509538(CHEMBL4513295)
Affinity DataKd:  6.70E+5nM. Assay description: Binding affinity at recombinant human C-terminal Galectin 9 expressed in Escherichia coli BL21 incubated for 5 mins by fluorescence anisotropy assay
Ligand InfoPC cidPC sid
In DepthDetails ArticlePubMed
TargetGalectin-2(Homo sapiens (Human))
Lund University
Curated by ChEMBL
LigandPNGBDBM50509538(CHEMBL4513295)
Affinity DataKd:  5.20E+6nM. Assay description: Binding affinity at recombinant human Galectin 2 expressed in Escherichia coli BL21 incubated for 5 mins by fluorescence anisotropy assay
Ligand InfoPC cidPC sid
In DepthDetails ArticlePubMed
TargetGalectin-1(Homo sapiens (Human))
Lund University
Curated by ChEMBL
LigandPNGBDBM50509538(CHEMBL4513295)
Affinity DataKd:  8.50E+5nM. Assay description: Binding affinity at recombinant human Galectin 1 expressed in Escherichia coli BL21 incubated for 5 mins by fluorescence anisotropy assay
Ligand InfoPC cidPC sid
In DepthDetails ArticlePubMed
TargetGalectin-9(Homo sapiens (Human))
Lund University
Curated by ChEMBL
LigandPNGBDBM50509538(CHEMBL4513295)
Affinity DataKd:  1.70E+6nM. Assay description: Binding affinity at recombinant human N-terminal Galectin 9 expressed in Escherichia coli BL21 incubated for 5 mins by fluorescence anisotropy assay
Ligand InfoPC cidPC sid
In DepthDetails ArticlePubMed
TargetGalectin-4(Homo sapiens (Human))
Lund University
Curated by ChEMBL
LigandPNGBDBM50509538(CHEMBL4513295)
Affinity DataKd:  1.00E+6nM. Assay description: Binding affinity at recombinant human C-terminal Galectin 4 expressed in Escherichia coli BL21 incubated for 5 mins by fluorescence anisotropy assay
Ligand InfoPC cidPC sid
In DepthDetails ArticlePubMed