BDBM50510707 CHEMBL4541649
SMILES NC(=S)NNc1ncnc2n(ncc12)-c1ccc(cc1)C#N
InChI Key InChIKey=YCFCSVRBVAWFRQ-UHFFFAOYSA-N
Data  1 IC50
  Tab Delimited (TSV)   2D SDfile   Computed 3D by Vconf -m prep SDfile
Find this compound or compounds like it in BindingDB:
Activity Spreadsheet -- Enzyme Inhibition Constant Data from BindingDB
Found 1 hit for monomerid = 50510707
TargetArginase(Leishmania amazonensis)
Instituto De Tecnologia Em Farmacos
Curated by ChEMBL
LigandPNGBDBM50510707(CHEMBL4541649)
Affinity DataIC50:  1.00E+5nM. Assay description: Inhibition of recombinant Leishmania amazonensis arginase expressed in Escherichia coli using L-arginine as substrate
Ligand InfoPC cidPC sid
In DepthDetails ArticlePubMed