BDBM50510709 CHEMBL4571367
SMILES NC(=S)NNc1ncnc2n(ncc12)-c1ccccc1
InChI Key InChIKey=RVGOKJBWPSYAFH-UHFFFAOYSA-N
Data  1 IC50
  Tab Delimited (TSV)   2D SDfile   Computed 3D by Vconf -m prep SDfile
Find this compound or compounds like it in BindingDB:
Activity Spreadsheet -- Enzyme Inhibition Constant Data from BindingDB
Found 1 hit for monomerid = 50510709
TargetArginase(Leishmania amazonensis)
Instituto De Tecnologia Em Farmacos
Curated by ChEMBL
LigandPNGBDBM50510709(CHEMBL4571367)
Affinity DataIC50:  1.20E+4nM. Assay description: Inhibition of recombinant Leishmania amazonensis arginase expressed in Escherichia coli using L-arginine as substrate
Ligand InfoPC cidPC sid
In DepthDetails ArticlePubMed