BDBM50512458 CHEMBL4450240
SMILES Cc1nc(ccc1Nc1nc(NC2CCOCC2)c2c(c[nH]c2n1)C#N)N1CCOCC1
InChI Key InChIKey=BXNPMKUGMSFVIC-UHFFFAOYSA-N
Data  1 KI  1 IC50
  Tab Delimited (TSV)   2D SDfile   Computed 3D by Vconf -m prep SDfile
Find this compound or compounds like it in BindingDB:
Activity Spreadsheet -- Enzyme Inhibition Constant Data from BindingDB
Found 1 hit for monomerid = 50512458
TargetDual specificity protein kinase TTK(Homo sapiens (Human))
Jilin University
Curated by ChEMBL
LigandPNGBDBM50512458(CHEMBL4450240)
Affinity DataIC50:  2.5nM. Assay description: Inhibition of MPS1 (510 to 857 residues) catalytic domain (unknown origin) expressed in Escherichia coli after 15 mins by mass-spectrometry analysis
Ligand InfoPC cidPC sid
In DepthDetails ArticlePubMed