BDBM50512680 CHEMBL4469542
SMILES Br.N#Cc1ccccc1-c1ccc(CN2C3=NCCN3c3ccccc23)cc1
InChI Key InChIKey=PNNMYUCAQIYUCE-UHFFFAOYSA-N
Data  2 EC50
  Tab Delimited (TSV)   2D SDfile   Computed 3D by Vconf -m prep SDfile
Find this compound or compounds like it in BindingDB:
Activity Spreadsheet -- Enzyme Inhibition Constant Data from BindingDB
Found 2 hits for monomerid = 50512680
Target5'-AMP-activated protein kinase catalytic subunit alpha-1/subunit beta-1/subunit gamma-1(Homo sapiens (Human))
Volgograd State Medical University
Curated by ChEMBL
LigandPNGBDBM50512680(CHEMBL4469542)
Affinity DataEC50:  1.09E+5nM. Assay description: Activation of C-terminal His tagged human recombinant full length AMPK alpha1/beta1/gamma1 expressed in baculovirus infected Sf9 cells using SAMS pep...
Ligand InfoPC cidPC sid
In DepthDetails ArticlePubMed
Target5'-AMP-activated protein kinase catalytic subunit alpha-1/subunit beta-1/subunit gamma-1(Homo sapiens (Human))
Volgograd State Medical University
Curated by ChEMBL
LigandPNGBDBM50512680(CHEMBL4469542)
Affinity DataEC50:  1.09E+5nM. Assay description: Activation of C-terminal His tagged human recombinant full length AMPK alpha1/beta1/gamma1 expressed in baculovirus infected Sf9 cells using SAMS pep...
Ligand InfoPC cidPC sid
In DepthDetails ArticlePubMed