BDBM50513179 CHEMBL4558884
SMILES CC(C)S(=O)(=O)c1ccc(cc1)-c1cnc(N)c(n1)-c1ncc(o1)-c1ccccc1
InChI Key InChIKey=FFAHJLYXBNJYCX-UHFFFAOYSA-N
Data  3 KI  1 IC50
  Tab Delimited (TSV)   2D SDfile   Computed 3D by Vconf -m prep SDfile
Find this compound or compounds like it in BindingDB:
Activity Spreadsheet -- Enzyme Inhibition Constant Data from BindingDB
Found 4 hits for monomerid = 50513179
TargetSerine/threonine-protein kinase ATR(Homo sapiens (Human))
Vertex Pharmaceuticals (Europe)
Curated by ChEMBL
LigandPNGBDBM50513179(CHEMBL4558884)
Affinity DataKi:  4nM. Assay description: Inhibition of recombinant human full-length N-terminal Flag epitope-tagged ATR expressed in HEK293T cells using ASELPASQPQPFSAKKK peptide as substrat...
Ligand InfoPC cidPC sid
In DepthDetails ArticlePubMed
TargetDNA-dependent protein kinase catalytic subunit(Homo sapiens (Human))
Vertex Pharmaceuticals (Europe)
Curated by ChEMBL
LigandPNGBDBM50513179(CHEMBL4558884)
Affinity DataKi: >4.00E+3nM. Assay description: Inhibition of purified recombinant human full-length DNA-PK using EPPLSQEAFADLWKKK peptide as substrate measured after 2 hrs in presence of [gamma-33...
Ligand InfoPC cidPC sid
In DepthDetails ArticlePubMed
TargetSerine-protein kinase ATM(Homo sapiens (Human))
Vertex Pharmaceuticals (Europe)
Curated by ChEMBL
LigandPNGBDBM50513179(CHEMBL4558884)
Affinity DataKi: >1.00E+4nM. Assay description: Inhibition of full-length ATM (unknown origin) using DPSVEPPLSQETFSDKKK peptide as substrate measured after 24 hrs in presence of [gamma-33P] ATP by ...
Ligand InfoPC cidPC sid
In DepthDetails ArticlePubMed
TargetSerine/threonine-protein kinase ATR(Homo sapiens (Human))
Vertex Pharmaceuticals (Europe)
Curated by ChEMBL
LigandPNGBDBM50513179(CHEMBL4558884)
Affinity DataIC50: >2.50E+3nM. Assay description: Inhibition of ATR in human HCT116 cells assessed as reduction in histone H2AX phosphorylation by Hoechst staining-based immunofluorescence microscopi...
Ligand InfoPC cidPC sid
In DepthDetails ArticlePubMed