BDBM50513944 CHEMBL4453820
SMILES [H][C@]12O[C@H](C(F)F)[C@@H](O)[C@H](O)[C@@]1([H])N=C(S2)N1CCC1
InChI Key InChIKey=QGBWBARJAAJENQ-CRYJZLASSA-N
Data  2 KI
  Tab Delimited (TSV)   2D SDfile   Computed 3D by Vconf -m prep SDfile
Find this compound or compounds like it in BindingDB:
Activity Spreadsheet -- Enzyme Inhibition Constant Data from BindingDB
Found 2 hits for monomerid = 50513944
TargetProtein O-GlcNAcase(Homo sapiens (Human))
Merck
Curated by ChEMBL
LigandPNGBDBM50513944(CHEMBL4453820)
Affinity DataKi:  26nM. Assay description: Inhibition of recombinant human OGA
Ligand InfoPC cidPC sid
In DepthDetails ArticlePubMed
TargetBeta-hexosaminidase subunit beta(Homo sapiens (Human))
Merck
Curated by ChEMBL
LigandPNGBDBM50513944(CHEMBL4453820)
Affinity DataKi: >1.00E+4nM. Assay description: Inhibition of human beta hexosaminidase assessed as inhibitory constant using 4-methylumbelliferyl N-acetyl-beta-D-glucosaminide dihydrate as substra...
Ligand InfoPC cidPC sid
In DepthDetails ArticlePubMed