BDBM50514415 CHEMBL4527561
SMILES ONC(=O)C[C@@H](Cc1ccc2ccccc2c1)N1NNC(CNC(=O)c2ccc(F)cc2)=C1
InChI Key InChIKey=ZUTZOTYDSZQWNM-JOCHJYFZSA-N
Data  1 IC50
  Tab Delimited (TSV)   2D SDfile   Computed 3D by Vconf -m prep SDfile
Find this compound or compounds like it in BindingDB:
Activity Spreadsheet -- Enzyme Inhibition Constant Data from BindingDB
Found 1 hit for monomerid = 50514415
TargetInsulin-degrading enzyme(Homo sapiens (Human))
Univ. Lille
Curated by ChEMBL
LigandPNGBDBM50514415(CHEMBL4527561)
Affinity DataIC50:  56nM. Assay description: Inhibition of human recombinant IDE pre-incubated for 10 mins before Cys-Lys-Leu-Val-Phe-Phe-Ala-Glu-Asp-Trp substrate addition and measured after 30...
Ligand InfoPC cidPC sid
In DepthDetails ArticlePubMed