BDBM50515041 CHEMBL4125960
SMILES CCN1CCN(Cc2ccc(NC(=O)c3ccc(C)c(Oc4ccnc5[nH]ccc45)c3)cc2C(F)(F)F)CC1
InChI Key InChIKey=SMPGEBOIKULBCT-UHFFFAOYSA-N
Data  4 IC50
PDB links: 1 PDB ID matches this monomer.
  Tab Delimited (TSV)   2D SDfile   Computed 3D by Vconf -m prep SDfile
Find this compound or compounds like it in BindingDB:
Activity Spreadsheet -- Enzyme Inhibition Constant Data from BindingDB
Found 4 hits for monomerid = 50515041
TargetTyrosine-protein kinase Fes/Fps(Homo sapiens (Human))
Sichuan Academy Of Medical Science & Sichuan Provincial People'S Hospital
Curated by ChEMBL
LigandPNGBDBM50515041(CHEMBL4125960)
Affinity DataIC50:  527nM. Assay description: Inhibition of FES (unknown origin)
In DepthDetails ArticlePubMed
TargetReceptor-type tyrosine-protein kinase FLT3(Homo sapiens (Human))
Sichuan Academy Of Medical Science & Sichuan Provincial People'S Hospital
Curated by ChEMBL
LigandPNGBDBM50515041(CHEMBL4125960)
Affinity DataIC50:  149nM. Assay description: Inhibition of FLT3 ITD mutant (unknown origin)
In DepthDetails ArticlePubMed
TargetReceptor-type tyrosine-protein kinase FLT3(Homo sapiens (Human))
Sichuan Academy Of Medical Science & Sichuan Provincial People'S Hospital
Curated by ChEMBL
LigandPNGBDBM50515041(CHEMBL4125960)
Affinity DataIC50:  3.65E+3nM. Assay description: Inhibition of FLT3 D835Y mutant (unknown origin)
In DepthDetails ArticlePubMed
TargetReceptor-type tyrosine-protein kinase FLT3(Homo sapiens (Human))
Sichuan Academy Of Medical Science & Sichuan Provincial People'S Hospital
Curated by ChEMBL
LigandPNGBDBM50515041(CHEMBL4125960)
Affinity DataIC50:  536nM. Assay description: Inhibition of wild type FLT3 (unknown origin)
In DepthDetails ArticlePubMed