BDBM50516249 CHEMBL4524602
SMILES CCCN(C)C(=O)NC1CCN(CC1)c1ncnc2n(c(nc12)-c1ccccc1Cl)-c1ccc(Cl)cc1
InChI Key InChIKey=RYYQBEUSAGAJPE-UHFFFAOYSA-N
Data  2 KI
  Tab Delimited (TSV)   2D SDfile   Computed 3D by Vconf -m prep SDfile
Find this compound or compounds like it in BindingDB:
Activity Spreadsheet -- Enzyme Inhibition Constant Data from BindingDB
Found 2 hits for monomerid = 50516249
TargetCannabinoid receptor 1(Homo sapiens (Human))
Rti International
Curated by ChEMBL
LigandPNGBDBM50516249(CHEMBL4524602)
Affinity DataKi:  0.900nM. Assay description: Displacement of [3H]CP55940 from human CB1 receptor expressed in HEK293 cell membranes
Ligand InfoPC cidPC sid
In DepthDetails ArticlePubMed
TargetCannabinoid receptor 2(Homo sapiens (Human))
Rti International
Curated by ChEMBL
LigandPNGBDBM50516249(CHEMBL4524602)
Affinity DataKi:  630nM. Assay description: Displacement of [3H]CP55940 from human CB2 receptor expressed in HEK293 cell membranes
Ligand InfoPC cidPC sid
In DepthDetails ArticlePubMed