BDBM50516251 CHEMBL4449377
SMILES Clc1ccc(cc1)-n1c(nc2c(ncnc12)N1CCC(CC1)NC(=O)NC1CCCC1)-c1ccccc1Cl
InChI Key InChIKey=LAZZAAKRRFJCNI-UHFFFAOYSA-N
Data  2 KI
  Tab Delimited (TSV)   2D SDfile   Computed 3D by Vconf -m prep SDfile
Find this compound or compounds like it in BindingDB:
Activity Spreadsheet -- Enzyme Inhibition Constant Data from BindingDB
Found 2 hits for monomerid = 50516251
TargetCannabinoid receptor 1(Homo sapiens (Human))
Rti International
Curated by ChEMBL
LigandPNGBDBM50516251(CHEMBL4449377)
Affinity DataKi:  3nM. Assay description: Displacement of [3H]CP55940 from human CB1 receptor expressed in HEK293 cell membranes
Ligand InfoPC cidPC sid
In DepthDetails ArticlePubMed
TargetCannabinoid receptor 2(Homo sapiens (Human))
Rti International
Curated by ChEMBL
LigandPNGBDBM50516251(CHEMBL4449377)
Affinity DataKi: >1.00E+4nM. Assay description: Displacement of [3H]CP55940 from human CB2 receptor expressed in HEK293 cell membranes
Ligand InfoPC cidPC sid
In DepthDetails ArticlePubMed