BDBM50516340 CHEMBL4439678
SMILES CC(C)C[C@@H]1NC(=O)[C@H](CCC(O)=O)NC(=O)[C@@H]2CCCN2C(=O)[C@H](Cc2cnc[nH]2)NC(=O)[C@H](CC(N)=O)NC(=O)[C@@H](NC(=O)[C@H](CC(N)=O)NC(=O)[C@@H]2CSSC[C@H](NC(=O)CN)C(=O)N[C@@H](CSSC[C@H](NC1=O)C(N)=O)C(=O)N[C@@H](CO)C(=O)N[C@@H](Cc1cnc[nH]1)C(=O)N1CCC[C@H]1C(=O)N[C@@H](C)C(=O)N2)C(C)C
InChI Key InChIKey=SGVSOCSOUHHZAS-VSZQRYKDSA-N
Data  4 IC50
  Tab Delimited (TSV)   2D SDfile   Computed 3D by Vconf -m prep SDfile
Find this compound or compounds like it in BindingDB:
Activity Spreadsheet -- Enzyme Inhibition Constant Data from BindingDB
Found 4 hits for monomerid = 50516340
TargetNeuronal acetylcholine receptor subunit alpha-3/beta-2(Rattus norvegicus (Rat))
Veterans Affairs Medical Center
Curated by ChEMBL
LigandPNGBDBM50516340(CHEMBL4439678)
Affinity DataIC50:  9.30nM. Assay description: Antagonist activity at rat alpha3beta2 nACHR expressed in Xenopus laevis oocytes assessed as inhibition of Ach-induced response at -70 mV holding pot...
Ligand InfoPC cidPC sid
In DepthDetails ArticlePubMed
TargetNeuronal acetylcholine receptor subunit alpha-6/beta-4(Rattus norvegicus (Rat))
Veterans Affairs Medical Center
Curated by ChEMBL
LigandPNGBDBM50516340(CHEMBL4439678)
Affinity DataIC50:  17nM. Assay description: Inhibition of rat alpha6beta4 nAChR expressed in Xenopus laevis oocytes assessed as inhibition of acetylcholine-induced current response measured aft...
Ligand InfoPC cidPC sid
In DepthDetails ArticlePubMed
TargetNeuronal acetylcholine receptor subunit alpha-3/alpha-6/beta-4(Rattus norvegicus (Rat))
Veterans Affairs Medical Center
Curated by ChEMBL
LigandPNGBDBM50516340(CHEMBL4439678)
Affinity DataIC50:  13nM. Assay description: Inhibition of rat alpha6/alpha3beta4 nAChR expressed in Xenopus laevis oocytes assessed as inhibition of acetylcholine-induced current response measu...
Ligand InfoPC cidPC sid
In DepthDetails ArticlePubMed
TargetNeuronal acetylcholine receptor subunit alpha-3/alpha-6/beta-4(Homo sapiens (Human))
Veterans Affairs Medical Center
Curated by ChEMBL
LigandPNGBDBM50516340(CHEMBL4439678)
Affinity DataIC50:  2.20nM. Assay description: Inhibition of human alpha6/alpha3beta4 nAChR expressed in Xenopus laevis oocytes assessed as inhibition of acetylcholine-induced current response mea...
Ligand InfoPC cidPC sid
In DepthDetails ArticlePubMed