BDBM50517502 CHEMBL4439392
SMILES O[C@H]([C@@H](O)C(O)=O)C(O)=O.O=C(CN1CCCCCC1)Nc1ccc(OC2CCN(CC2)C2CCC2)cc1
InChI Key InChIKey=DXUYBCGTCCFLKP-LREBCSMRSA-N
Data  1 KI
  Tab Delimited (TSV)   2D SDfile   Computed 3D by Vconf -m prep SDfile
Find this compound or compounds like it in BindingDB:
Activity Spreadsheet -- Enzyme Inhibition Constant Data from BindingDB
Found 1 hit for monomerid = 50517502
TargetHistamine H3 receptor(Homo sapiens (Human))
Suven Life Sciences
Curated by ChEMBL
LigandPNGBDBM50517502(CHEMBL4439392)
Affinity DataKi:  2.60nM. Assay description: Displacement of [3]-RAMH from recombinant human histamine H3 receptor expressed in CHO-K1 cell membranes after 60 mins by scintillation counting
Ligand InfoPC cidPC sid
In DepthDetails ArticlePubMed