BDBM50517503 CHEMBL4515283
SMILES Cl.Cl.FC1CCN(CC(=O)Nc2ccc(OC3CCN(CC3)C3CCCC3)cc2)CC1
InChI Key InChIKey=BKKHMKVHCGHLFS-UHFFFAOYSA-N
Data  1 KI
  Tab Delimited (TSV)   2D SDfile   Computed 3D by Vconf -m prep SDfile
Find this compound or compounds like it in BindingDB:
Activity Spreadsheet -- Enzyme Inhibition Constant Data from BindingDB
Found 1 hit for monomerid = 50517503
TargetHistamine H3 receptor(Homo sapiens (Human))
Suven Life Sciences
Curated by ChEMBL
LigandPNGBDBM50517503(CHEMBL4515283)
Affinity DataKi:  11nM. Assay description: Displacement of [3]-RAMH from recombinant human histamine H3 receptor expressed in CHO-K1 cell membranes after 60 mins by scintillation counting
Ligand InfoPC cidPC sid
In DepthDetails ArticlePubMed