BDBM50517508 CHEMBL4594107
SMILES CC(C)N1CCCN(CC(=O)Nc2ccc(OC3CCN(CC3)C3CCC3)cc2C(F)(F)F)CC1
InChI Key InChIKey=CDBBTVHHUSLXBU-UHFFFAOYSA-N
Data  1 KI
  Tab Delimited (TSV)   2D SDfile   Computed 3D by Vconf -m prep SDfile
Find this compound or compounds like it in BindingDB:
Activity Spreadsheet -- Enzyme Inhibition Constant Data from BindingDB
Found 1 hit for monomerid = 50517508
TargetHistamine H3 receptor(Homo sapiens (Human))
Suven Life Sciences
Curated by ChEMBL
LigandPNGBDBM50517508(CHEMBL4594107)
Affinity DataKi:  0.960nM. Assay description: Displacement of [3]-RAMH from recombinant human histamine H3 receptor expressed in CHO-K1 cell membranes after 60 mins by scintillation counting
Ligand InfoPC cidPC sid
In DepthDetails ArticlePubMed