BDBM50517513 CHEMBL4444723
SMILES Cc1cc(OC2CCN(CC2)C2CCC2)ccc1NC(=O)CN1CCOCC1
InChI Key InChIKey=HEHZYYQSIYQDMH-UHFFFAOYSA-N
Data  1 KI
  Tab Delimited (TSV)   2D SDfile   Computed 3D by Vconf -m prep SDfile
Find this compound or compounds like it in BindingDB:
Activity Spreadsheet -- Enzyme Inhibition Constant Data from BindingDB
Found 1 hit for monomerid = 50517513
TargetHistamine H3 receptor(Homo sapiens (Human))
Suven Life Sciences
Curated by ChEMBL
LigandPNGBDBM50517513(CHEMBL4444723)
Affinity DataKi:  22nM. Assay description: Displacement of [3]-RAMH from recombinant human histamine H3 receptor expressed in CHO-K1 cell membranes after 60 mins by scintillation counting
Ligand InfoPC cidPC sid
In DepthDetails ArticlePubMed