BDBM50518241 CHEMBL4569923
SMILES CC[C@H](C)[C@@H]1NC(=O)[C@@H]2CCCN2C(=O)[C@@H]2CCCN2C(=O)[C@H](CCCNC(N)=N)NC(=O)[C@H](CO)NC(=O)[C@H](CCCCN)NC(=O)[C@H](Cc2ccc(O)cc2)NC(=O)[C@@H]2CSSC[C@H](NC1=O)C(=O)N[C@@H](Cc1ccccc1)C(=O)N1CCC[C@H]1C(=O)N[C@@H](CC(O)=O)C(=O)NCC(=O)N[C@@H](CCCNC(N)=N)C(=O)N2
InChI Key InChIKey=QNIDBHORVMQSDP-UFUSHNEESA-N
Data  12 KI
  Tab Delimited (TSV)   2D SDfile   Computed 3D by Vconf -m prep SDfile
Find this compound or compounds like it in BindingDB:
Activity Spreadsheet -- Enzyme Inhibition Constant Data from BindingDB
Found 12 hits for monomerid = 50518241
TargetPlasminogen(Homo sapiens (Human))
The University Of Queensland
Curated by ChEMBL
LigandPNGBDBM50518241(CHEMBL4569923)
Affinity DataKi:  0.0410nM. Assay description: Inhibition of human plasmin using Ac-RM(O2)YR-pNA as substrate after 30 mins
Ligand InfoPC cidPC sid
In DepthDetails ArticlePubMed
TargetSerine protease 1(Bos taurus (bovine))
The University Of Queensland
Curated by ChEMBL
LigandPNGBDBM50518241(CHEMBL4569923)
Affinity DataKi:  28nM. Assay description: Inhibition of bovine cationic trypsin using Bz-FVR-pNA as substrate after 30 mins
Ligand InfoPC cidPC sid
In DepthDetails ArticlePubMed
TargetCathepsin G(Homo sapiens (Human))
The University Of Queensland
Curated by ChEMBL
LigandPNGBDBM50518241(CHEMBL4569923)
Affinity DataKi:  1.30E+4nM. Assay description: Inhibition of human cathepsin G using Suc-AAPF-MCA as substrate after 30 mins
Ligand InfoPC cidPC sid
In DepthDetails ArticlePubMed
TargetUrokinase-type plasminogen activator(Homo sapiens (Human))
The University Of Queensland
Curated by ChEMBL
LigandPNGBDBM50518241(CHEMBL4569923)
Affinity DataKi: >5.00E+4nM. Assay description: Inhibition of uPA (unknown origin) using Z-Pyr-Gly-Arg-MCA as substrate after 30 mins relative to untreated control
Ligand InfoPC cidPC sid
In DepthDetails ArticlePubMed
TargetPlasma kallikrein(Homo sapiens (Human))
The University Of Queensland
Curated by ChEMBL
LigandPNGBDBM50518241(CHEMBL4569923)
Affinity DataKi: >5.00E+4nM. Assay description: Inhibition of plasma KLK (unknown origin) using Ac-NLTR-pNA as substrate after 30 mins relative to untreated control
Ligand InfoPC cidPC sid
In DepthDetails ArticlePubMed
TargetCoagulation factor IX(Homo sapiens (Human))
The University Of Queensland
Curated by ChEMBL
LigandPNGBDBM50518241(CHEMBL4569923)
Affinity DataKi: >5.00E+4nM. Assay description: Inhibition of activated beta-factor 9 (unknown origin) using Boc-QGR-MCA as substrate after 30 mins relative to untreated control
Ligand InfoPC cidPC sid
In DepthDetails ArticlePubMed
TargetTissue-type plasminogen activator(Homo sapiens (Human))
The University Of Queensland
Curated by ChEMBL
LigandPNGBDBM50518241(CHEMBL4569923)
Affinity DataKi: >5.00E+4nM. Assay description: Inhibition of tPA (unknown origin) using Z-Pyr-Gly-Arg-MCA as substrate after 30 mins relative to untreated control
Ligand InfoPC cidPC sid
In DepthDetails ArticlePubMed
TargetCoagulation factor XII(Homo sapiens (Human))
The University Of Queensland
Curated by ChEMBL
LigandPNGBDBM50518241(CHEMBL4569923)
Affinity DataKi: >5.00E+4nM. Assay description: Inhibition of activated beta-factor 12 (unknown origin) using Ac-QRFR-pNA as substrate after 30 mins relative to untreated control
Ligand InfoPC cidPC sid
In DepthDetails ArticlePubMed
TargetSuppressor of tumorigenicity 14 protein(Homo sapiens (Human))
The University Of Queensland
Curated by ChEMBL
LigandPNGBDBM50518241(CHEMBL4569923)
Affinity DataKi: >5.00E+4nM. Assay description: Inhibition of matriptase (unknown origin) using Boc-QAR-MCA as substrate after 30 mins relative to untreated control
Ligand InfoPC cidPC sid
In DepthDetails ArticlePubMed
TargetCoagulation factor X(Homo sapiens (Human))
The University Of Queensland
Curated by ChEMBL
LigandPNGBDBM50518241(CHEMBL4569923)
Affinity DataKi: >5.00E+4nM. Assay description: Inhibition of activated factor 10 (unknown origin) using Ac-QRSR-pNA as substrate after 30 mins relative to untreated control
Ligand InfoPC cidPC sid
In DepthDetails ArticlePubMed
TargetCoagulation factor XI(Homo sapiens (Human))
The University Of Queensland
Curated by ChEMBL
LigandPNGBDBM50518241(CHEMBL4569923)
Affinity DataKi: >5.00E+4nM. Assay description: Inhibition of activated beta-factor 11 (unknown origin) using Bz-FVRpNA as substrate after 30 mins relative to untreated control
Ligand InfoPC cidPC sid
In DepthDetails ArticlePubMed
TargetProthrombin(Homo sapiens (Human))
The University Of Queensland
Curated by ChEMBL
LigandPNGBDBM50518241(CHEMBL4569923)
Affinity DataKi: >5.00E+4nM. Assay description: Inhibition of human thrombin using Ac-ATPR-pNA as substrate after 30 mins relative to untreated control
Ligand InfoPC cidPC sid
In DepthDetails ArticlePubMed