BDBM50521890 CHEMBL4475996
SMILES CCCCC(=O)NC1CCN(CC1)c1ncnc2n(c(nc12)-c1ccccc1Cl)-c1ccc(nc1)C(F)(F)F
InChI Key InChIKey=USODMUAOORTTEQ-UHFFFAOYSA-N
Data  2 KI
  Tab Delimited (TSV)   2D SDfile   Computed 3D by Vconf -m prep SDfile
Find this compound or compounds like it in BindingDB:
Activity Spreadsheet -- Enzyme Inhibition Constant Data from BindingDB
Found 2 hits for monomerid = 50521890
TargetCannabinoid receptor 1(Homo sapiens (Human))
Rti International
Curated by ChEMBL
LigandPNGBDBM50521890(CHEMBL4475996)
Affinity DataKi:  3nM. Assay description: Displacement of [3H]-CP55940 from human CB1 receptor expressed in CHO cell membranes
Ligand InfoPC cidPC sid
In DepthDetails ArticlePubMed
TargetCannabinoid receptor 2(Homo sapiens (Human))
Rti International
Curated by ChEMBL
LigandPNGBDBM50521890(CHEMBL4475996)
Affinity DataKi:  420nM. Assay description: Displacement of [3H]-CP55940 from human CB2 receptor expressed in CHO cell membranes
Ligand InfoPC cidPC sid
In DepthDetails ArticlePubMed