BDBM50521946 CHEMBL4211729
SMILES CC(=O)Nc1ccccc1C(F)(F)C(=O)NNc1ccccn1
InChI Key InChIKey=RQFSJEAXZYRFMR-UHFFFAOYSA-N
Data  1 IC50
  Tab Delimited (TSV)   2D SDfile   Computed 3D by Vconf -m prep SDfile
Find this compound or compounds like it in BindingDB:
Activity Spreadsheet -- Enzyme Inhibition Constant Data from BindingDB
Found 1 hit for monomerid = 50521946
TargetArginase(Leishmania amazonensis)
Universidade Federal Do Rio De Janeiro
Curated by ChEMBL
LigandPNGBDBM50521946(CHEMBL4211729)
Affinity DataIC50: >1.00E+5nM. Assay description: Inhibition of recombinant Leishmania amazonensis arginase expressed in Escherichia coli assessed as reduction in urea production using L-arginine as ...
Ligand InfoPC cidPC sid
In DepthDetails ArticlePubMed