BDBM50523504 CHEMBL4454855
SMILES OC[C@H]1CCCN1Cc1ccc(COc2cccc(OCc3ccccc3Cl)c2)cc1
InChI Key InChIKey=LTOXJDUJWHRAKL-HSZRJFAPSA-N
Data  2 IC50
  Tab Delimited (TSV)   2D SDfile   Computed 3D by Vconf -m prep SDfile
Find this compound or compounds like it in BindingDB:
Activity Spreadsheet -- Enzyme Inhibition Constant Data from BindingDB
Found 2 hits for monomerid = 50523504
TargetSphingosine kinase 1(Homo sapiens (Human))
Heriot-Watt University
Curated by ChEMBL
LigandPNGBDBM50523504(CHEMBL4454855)
Affinity DataIC50:  39nM. Assay description: Inhibition of GFP-tagged SK1 (unknown origin) expressed in HEK293 cells using Sph as substrate measured after 30 mins in presence of [gamma32P]ATP by...
Ligand InfoPC cidPC sid
In DepthDetails ArticlePubMed
TargetSphingosine kinase 2(Homo sapiens (Human))
Heriot-Watt University
Curated by ChEMBL
LigandPNGBDBM50523504(CHEMBL4454855)
Affinity DataIC50:  151nM. Assay description: Inhibition of recombinant human full-length N-terminal His-tagged SK2 expressed in baculovirus infected Sf9 insect cells using Sph as substrate measu...
Ligand InfoPC cidPC sid
In DepthDetails ArticlePubMed