BDBM50524273 CHEMBL4447840
SMILES CCCCCCC(=O)N[C@@H](C)C(=O)N[C@@H](CC(C)C)C(=O)[C@@]1(CO)CO1
InChI Key InChIKey=HPAGFWZVTGGUPS-YZVOILCLSA-N
Data  2 IC50
  Tab Delimited (TSV)   2D SDfile   Computed 3D by Vconf -m prep SDfile
Find this compound or compounds like it in BindingDB:
Activity Spreadsheet -- Enzyme Inhibition Constant Data from BindingDB
Found 2 hits for monomerid = 50524273
TargetProteasome subunit beta type-5(Homo sapiens (Human))
University Of Kentucky
Curated by ChEMBL
LigandPNGBDBM50524273(CHEMBL4447840)
Affinity DataIC50:  1.70E+3nM. Assay description: Inhibition of 20S proteasome beta5 subunit in human RPMI8226 cell lysate using Suc-LLVY-AMC as substrate pretreated for 1 hr followed by substrate ad...
Ligand InfoPC cidPC sid
In DepthDetails ArticlePubMed
TargetProteasome subunit beta type-9(Homo sapiens (Human))
University Of Kentucky
Curated by ChEMBL
LigandPNGBDBM50524273(CHEMBL4447840)
Affinity DataIC50:  36nM. Assay description: Inhibition of purified human 20S immunoproteasome beta1 subunit using Ac-Pro-Ala-Leu-AMC as substrate pretreated for 1 hr followed by substrate addit...
Ligand InfoPC cidPC sid
In DepthDetails ArticlePubMed