BDBM50524821 CHEMBL4462682
SMILES CCC(C)C(NC(=O)[C@@H]1CCCN1C(=O)[C@@H](NC(=O)OC(C)(C)C)C(C)(C)C)P(=O)(Oc1ccccc1)Oc1ccccc1
InChI Key InChIKey=QAFMOAIDLYWHIL-QWXSGBELSA-N
Data  4 IC50
  Tab Delimited (TSV)   2D SDfile   Computed 3D by Vconf -m prep SDfile
Find this compound or compounds like it in BindingDB:
Activity Spreadsheet -- Enzyme Inhibition Constant Data from BindingDB
Found 4 hits for monomerid = 50524821
TargetNeutrophil elastase(Homo sapiens (Human))
University Of Otago
Curated by ChEMBL
LigandPNGBDBM50524821(CHEMBL4462682)
Affinity DataIC50:  2.35E+3nM. Assay description: Inhibition of human neutrophil elastase using AAPV-pNA as substrate preincubated for 15 mins followed by substrate addition and measured every 15 sec...
Ligand InfoPC cidPC sid
In DepthDetails ArticlePubMed
TargetNeutrophil elastase(Homo sapiens (Human))
University Of Otago
Curated by ChEMBL
LigandPNGBDBM50524821(CHEMBL4462682)
Affinity DataIC50:  1.35E+4nM. Assay description: Inhibition of human neutrophil elastase using methoxysuccinyl-Ala-Ala-Pro-Val-pNA as substrate incubated for 15 min
Ligand InfoPC cidPC sid
In DepthDetails ArticlePubMed
TargetProbable periplasmic serine endoprotease DegP-like(Chlamydia trachomatis (strain D/UW-3/Cx))
University Of Otago
Curated by ChEMBL
LigandPNGBDBM50524821(CHEMBL4462682)
Affinity DataIC50:  1.03E+4nM. Assay description: Inhibition of recombinant ctHtrA serine protease using MeOCoum-ENLHLPLPI1F-D as substrate pretreated for 10 min followed by substrate addition and me...
Ligand InfoPC cidPC sid
In DepthDetails ArticlePubMed
TargetTrypsin(Homo sapiens (Human))
University Of Otago
Curated by ChEMBL
LigandPNGBDBM50524821(CHEMBL4462682)
Affinity DataIC50: >5.00E+5nM. Assay description: Inhibition of human trypsin using Nalpha-benzoyl-DL-R-pNA as substrate preincubated for 15 mins followed by substrate addition and measured every 15 ...
Ligand InfoPC cidPC sid
In DepthDetails ArticlePubMed