BDBM50524823 CHEMBL4435385
SMILES CCC(=O)C(=O)C(NC(=O)[C@@H]1CCCN1C(=O)[C@@H](NC(=O)OC(C)(C)C)C(C)C)C(C)C
InChI Key InChIKey=ZFZGZWSOLORCTD-YKOWGRMDSA-N
Data  2 IC50
  Tab Delimited (TSV)   2D SDfile   Computed 3D by Vconf -m prep SDfile
Find this compound or compounds like it in BindingDB:
Activity Spreadsheet -- Enzyme Inhibition Constant Data from BindingDB
Found 2 hits for monomerid = 50524823
TargetTrypsin(Homo sapiens (Human))
University Of Otago
Curated by ChEMBL
LigandPNGBDBM50524823(CHEMBL4435385)
Affinity DataIC50: >5.00E+5nM. Assay description: Inhibition of human trypsin using Nalpha-benzoyl-DL-R-pNA as substrate preincubated for 15 mins followed by substrate addition and measured every 15 ...
Ligand InfoPC cidPC sid
In DepthDetails ArticlePubMed
TargetNeutrophil elastase(Homo sapiens (Human))
University Of Otago
Curated by ChEMBL
LigandPNGBDBM50524823(CHEMBL4435385)
Affinity DataIC50:  4.71E+3nM. Assay description: Inhibition of human neutrophil elastase using AAPV-pNA as substrate preincubated for 15 mins followed by substrate addition and measured every 15 sec...
Ligand InfoPC cidPC sid
In DepthDetails ArticlePubMed