BDBM50525490 CHEMBL4437643
SMILES COC(=O)NC[C@@H](Cc1cnc2ccccc2c1)c1ccc(OCCCCCc2ccc(NC(=O)[C@H](C3CCCCC3)N3CCC[C@H](N)C3=O)cc2)cc1
InChI Key InChIKey=IGRIVAWLJUPVMM-UDEWTJCRSA-N
Data  1 IC50
PDB links: 1 PDB ID matches this monomer.
  Tab Delimited (TSV)   2D SDfile   Computed 3D by Vconf -m prep SDfile
Find this compound or compounds like it in BindingDB:
Activity Spreadsheet -- Enzyme Inhibition Constant Data from BindingDB
Found 1 hit for monomerid = 50525490
TargetInsulin-degrading enzyme(Homo sapiens (Human))
Univ. Lille
Curated by ChEMBL
LigandPNGBDBM50525490(CHEMBL4437643)
Affinity DataIC50:  4nM. Assay description: Inhibition of recombinant IDE exosite (unknown origin) expressed in Escherichia coli using insulin as substrate incubated for 4 hrs by AlphaLisa assa...
Ligand InfoPC cidPC sidPDB