BDBM50528145 CHEMBL4586218
SMILES [H][C@]12CO[C@@]3([H])OC(C[C@@]13[H])[C@H](C2)OC(=O)N[C@@H](Cc1cc(F)cc(F)c1)[C@H](O)CN(CC(C)C)S(=O)(=O)c1ccc2nc(NC3CC3)sc2c1
InChI Key InChIKey=CFZKKUVEJIGYDF-CJLHCJFTSA-N
Data  1 KI
  Tab Delimited (TSV)   2D SDfile   Computed 3D by Vconf -m prep SDfile
Find this compound or compounds like it in BindingDB:
Activity Spreadsheet -- Enzyme Inhibition Constant Data from BindingDB
Found 1 hit for monomerid = 50528145
TargetProtease(Human immunodeficiency virus 1 (HIV-1))
Purdue University
Curated by ChEMBL
LigandPNGBDBM50528145(CHEMBL4586218)
Affinity DataKi:  0.00700nM. Assay description: Inhibition of HIV-1 protease
Ligand InfoPC cidPC sid
In DepthDetails ArticlePubMed