BDBM50528282 CHEMBL4580391
SMILES COc1nn2cc(nc2s1)-c1cc2c(OCCOCc3ccccc3)cc(OC)cc2o1
InChI Key InChIKey=DYZRBFKRRQZPMZ-UHFFFAOYSA-N
Data  2 IC50
  Tab Delimited (TSV)   2D SDfile   Computed 3D by Vconf -m prep SDfile
Find this compound or compounds like it in BindingDB:
Activity Spreadsheet -- Enzyme Inhibition Constant Data from BindingDB
Found 2 hits for monomerid = 50528282
TargetProteinase-activated receptor 4(Homo sapiens (Human))
Bristol-Myers Squibb Research & Development
Curated by ChEMBL
LigandPNGBDBM50528282(CHEMBL4580391)
Affinity DataIC50:  500nM. Assay description: Antagonist activity at PAR4 in human platelet rich plasma assessed as inhibition of gamma-thrombin-induced platelet aggregation preincubated for 5 mi...
Ligand InfoPC cidPC sid
In DepthDetails ArticlePubMed
TargetProteinase-activated receptor 4(Homo sapiens (Human))
Bristol-Myers Squibb Research & Development
Curated by ChEMBL
LigandPNGBDBM50528282(CHEMBL4580391)
Affinity DataIC50:  1.80nM. Assay description: Antagonist activity at full-length human PAR4 expressed in HEK293 cells assessed as inhibition of AYPGKF-induced intracellular calcium mobilization p...
Ligand InfoPC cidPC sid
In DepthDetails ArticlePubMed